﻿"available","availableText","brand","categories/0","categories/1","ean","image","itemLocation","itemNumber","mpn","price","priceWithCurrency","seller","sold","subTitle","title","type","upc","url","wasPrice","wasPriceWithCurrency","whyToBuy/0","whyToBuy/1","whyToBuy/2","whyToBuy/3","whyToBuy/4","whyToBuy/5"
,"Limited quantity available","YELANGU","See more YELANGU  Hobby Grade Foldable Drones",,,"https://i.ebayimg.com/images/g/W3kAAOSwAHBhmKwk/s-l300.jpg","Hebron, Kentucky, United States","294025114305","Does Not Apply","32.99","US $32.99/ea","4drctoys","3","✅1 Days Shipping✅3 Battery✅3D Flip✅gift✅","2021 New RC Drone 4k HD Wide Angle Camera WIFI FPV Drone Dual Camera Quadcopter","Battery","0745761422813","https://www.ebay.com/itm/294025114305","41.8","US $41.80","Free shipping and returns","3,825 sold","Ships from United States",,,
,"Limited quantity available","DJI","See more DJI CP.MA.00000123.01 Drone Mavic Mini Fly Mor...",,,"https://i.ebayimg.com/images/g/qL0AAOSwp19foy6k/s-l300.jpg","New York, New York, United States","303727998473","CP.MA.00000123.01","289","US $289.00","dronesuperstore","1","DJI Official eBay Outlet Store, DJI Warranty Included","DJI Mavic Mini Fly More combo - Drone quadcopter Camera -Certified Refurbished","Ready to Fly Drone","745557817069","https://www.ebay.com/itm/303727998473","499","$499.00","1,094 sold","Free shipping and returns","Ships from United States",,,
,"Limited quantity available","DJI","See more DJI Mini 2 Fly More Combo Camera Drone",,,"https://i.ebayimg.com/images/g/NBIAAOSwLFFg7e5Y/s-l300.jpg","Fort Lauderdale, Florida, United States","265229466800","CP.MA.00000306.01.E","419.99","US $419.99","djiofficialstore","57","Official DJI eBay Store | Certified Refurbished","DJI Mini 2 Fly More Combo (DJI-Refurbished)","Ready to Fly Drone","Does Not Apply","https://www.ebay.com/itm/265229466800","599","$599.00","1,992 sold","Free shipping and returns","Ships from United States",,,
,"Limited quantity available","DJI","Camera Drones",,,"https://i.ebayimg.com/images/g/jyoAAOSwHxhhlsNF/s-l300.jpg","Fort Lauderdale, Florida, United States","265411879636","MINI-BUN-2BATTS, CP.MA.00000120.01.E","199.99","US $199.99","djiofficialstore","52","Official DJI eBay Store | Certified Refurbished","DJI Mavic Mini Bundle (Refurbished with 2 Extra Batteries)","Ready to Fly Drone","Does Not Apply","https://www.ebay.com/itm/265411879636","489","$489.00","52 sold","Free shipping and returns","Ships from United States",,,
"10","More than 10 available","Unbranded","Camera Drones","Other RC Model Vehicles & Kits",,"https://i.ebayimg.com/images/g/pp4AAOSwKtRgZPzC/s-l300.jpg","Alameda, California, United States","164790739659",,"39","US $39.00","everydaygadgetz","1","US Stock! Fast Shipping! Highest Quality! Best Service!","2021 New RC Drone 4k HD Wide Angle Camera WIFI FPV Drone Dual Camera Quadcopter","Professional Drone","Does not apply","https://www.ebay.com/itm/164790739659","41.05","US $41.05","1,460","Sold","30-day","Returns","1,966","Watchers"
,"Limited quantity available","YELANGU","See more YELANGU  Hobby Grade Foldable Drones",,,"https://i.ebayimg.com/images/g/W9AAAOSwlztgMgx5/s-l300.jpg","ca, United States","294030745192","Does Not Apply","30.99","US $30.99/ea","4drctoys","685","✅1 Days Shipping✅✅3D Flip✅Delivery within 7-12 days✅","2021 New RC Drone 4k HD Wide Angle Camera WIFI FPV Drone Dual Camera Quadcopter1","Battery","0745761422813","https://www.ebay.com/itm/294030745192","30.99","US $30.99","Free shipping and returns","685 sold","Ships from United States",,,
"10","More than 10 available","DJI","See more DJI Mavic Mini Camera Drone",,,"https://i.ebayimg.com/images/g/LQIAAOSwcfFheZk9/s-l300.jpg","New York, New York, United States","304078610211","CP.MA.00000120.01","249","US $249.00","dronesuperstore","725","DJI Official eBay Outlet Store","DJI Mavic Mini Portable Drone Quadcopter Starters Combo","Ready to Fly Drone","0190021338968","https://www.ebay.com/itm/304078610211","449","$449.00","725 sold","Free shipping and returns","Ships from United States",,,
,"Limited quantity available","4DRC","Camera Drones",,,"https://i.ebayimg.com/images/g/mLYAAOSwYY5g~Q5e/s-l300.jpg","Hebron, Kentucky, United States","294401171287",,"42.99","US $42.99/ea","4drctoys","12","","[Factory Refurbish] F3 Pro FPV GPS Drone with 4K HD Camera Quadcopter Follow Me","Selfie Drone","770971966376","https://www.ebay.com/itm/294401171287","42.99","US $42.99","Free shipping and returns","179 sold","Ships from United States",,,
"10","More than 10 available","Holy Stone","Camera Drones","Quadcopters & Multicopters",,"https://i.ebayimg.com/images/g/77MAAOSwbyFhemub/s-l300.jpg","Walton, Kentucky, United States","153877705078","Does not apply","269","US $269.00/ea","holystone_au","89","","Holy Stone HS720E Foldable Brushless GPS Drone 4K EIS Camera 5G FPV Quadcopter","Professional Drone","Does not apply","https://www.ebay.com/itm/153877705078","538","US $538.00","89 sold","30-day returns","Ships from United States",,,
,"Limited quantity available","4DRC","Camera Drones","Other RC Model Vehicles & Kits",,"https://i.ebayimg.com/images/g/XhoAAOSwp1NgiAyR/s-l300.jpg","Walnut, California, United States","294217841141",,"76.99","US $76.99/ea","4drctoys","273","American warehouse ****Free return****lifetime warranty","4DRC F9 2021 RC Drone GPS 4K HD DualCamera 5G WIFI FPV Brushless Motor Foldable","Professional Drone","739795507462","https://www.ebay.com/itm/294217841141","76.99","US $76.99","273 sold","Free shipping and returns","440 watchers",,,
"10","More than 10 available","4DRC","Quadcopters & Multicopters","Camera Drones",,"https://i.ebayimg.com/images/g/RuoAAOSwXORfUnEX/s-l300.jpg","Hebron, Kentucky, United States","293721032179","Does Not Apply","22.99","US $22.99/ea","4drctoys","214","✅1 Days Shipping✅3 Battery✅On sale✅Christmas gift✅","Mini 4DRCV2 Drone Selfie WIFI FPV With HD Camera RC Quadcopter Toy Gift US","Quadcopter","791537810230","https://www.ebay.com/itm/293721032179","22.99","US $22.99","Free shipping and returns","214 sold","Ships from United States",,,
"10","More than 10 available","Unbranded","Quadcopters & Multicopters","Camera Drones",,"https://i.ebayimg.com/images/g/TKwAAOSwDSBgPYps/s-l300.jpg","Alameda, California, United States","143965235556","Does Not Apply","125.51","US $125.51","everydaygadgetz","452","US Stock! Fast Shipping! Highest Quality! Best Service!","Professional F3 Drones GPS 5G WiFi FPV 4K/1080P HD Wide Angle Camera Foldable US","Quadcopter","Does not apply","https://www.ebay.com/itm/143965235556",,,"452 sold","Free shipping and returns","Ships from United States",,,
,"数量有限","4DRC","Camera Drones",,,"https://i.ebayimg.com/images/g/Zw4AAOSwpDJhYabV/s-l300.jpg","Hebron, Kentucky, 美国","294449363417",,"26.99","US $26.99","4drctoys","69","","[工厂翻新] v4 2021 FPV wifi 无人机遥控四轴飞行器高清摄像头飞机","Selfie Drone","799829798518","https://www.ebay.com/itm/294449363417",,,"已售出 69 件","30 天退货","99 位追踪者",,,
"10","More than 10 available","Cooligg","Camera Drones","Other RC Model Vehicles & Kits",,"https://i.ebayimg.com/images/g/uTgAAOSwWuNgGkul/s-l300.jpg","Windsor, New Jersey, United States","184648199304","Does Not Apply","50.69","US $50.69","mayvillage","826","","FPV Wifi RC Drone Wide Angle HD 4K Camera Foldable Quadcopter Selfie + 3 Battery","Selfie Drone","Does Not Apply","https://www.ebay.com/itm/184648199304","77.99","US $77.99","826 sold","30-day returns","1,239 watchers",,,
"10","More than 10 available","Holy Stone","Camera Drones","Quadcopters & Multicopters",,"https://i.ebayimg.com/images/g/6BgAAOSwNIdhg3xm/s-l300.jpg","Walton, Kentucky, United States","313610551848","Does Not Apply","199","US $199.00/ea","bettyuz-uk","64","","Holy Stone HS700D RC Drone With 4K HD Camera FPV GPS Quadcopter Brushless Motor","Ready to Fly Drone","Does not apply","https://www.ebay.com/itm/313610551848","699","US $699.00","64 sold","30-day returns","Ships from United States",,,
"10","More than 10 available","4DRC","Other RC Model Vehicles & Kits","Camera Drones",,"https://i.ebayimg.com/images/g/6LgAAOSwRhVgPN7c/s-l300.jpg","Hebron, Kentucky, United States","294063976498","Does Not Apply","28.99","US $28.99/ea","4drctoys","22","","2021 New RC Drone 4k HD Wide Angle Camera WIFI FPV Drone Dual Camera Quadcopter",,"787166532346","https://www.ebay.com/itm/294063976498","28.99","US $28.99","Free shipping and returns","153 sold","Ships from United States",,,
"10","More than 10 available","4DRC","See more 4drc-f3 GPS Drone With 4k HD Adjustment Camera...",,,"https://i.ebayimg.com/images/g/42gAAOSw6GNfaKyN/s-l300.jpg","Walnut, California, United States","293746427455",,"87.99","US $87.99/ea","4drctoys","187","✅1 Days Shipping✅2 Battery✅backpack✅Christmas gift✅","4DRC-F3 4K HD Wide Angle Camera GPS Drone FPV RC Quadcopter Wifi Follow Me","Selfie Drone","791537810513","https://www.ebay.com/itm/293746427455","87.99","US $87.99","187 sold","Free shipping and returns","521 watchers",,,
"10","More than 10 available","4DRC","Quadcopters & Multicopters","Camera Drones",,"https://i.ebayimg.com/images/g/-b4AAOSwSK5ezQzi/s-l300.jpg","Hebron, Kentucky, United States","293719255094","Does Not Apply","21.99","US $21.99/ea","4drctoys","248","✅1 Days Shipping✅3 Battery✅3D Flip✅American warehouse✅","4DRC-V2 Drone With 720P HD Wifi FPV Camera Foldable RC Quadcopter for kids Mini","Quadcopter","791537810230","https://www.ebay.com/itm/293719255094","21.99","US $21.99","Free shipping and returns","248 sold","Ships from United States",,,
,"Limited quantity available","DJI","See more DJI CP.TL.00000047.01 Tello Boost Combo Drone",,,"https://i.ebayimg.com/images/g/798AAOSw34xheuMs/s-l300.jpg","New York, New York, United States","304075610465","CPTL0000004701, CP.TL.00000047.01","99","US $99.00","dronesuperstore","44","DJI Official eBay Outlet Store, DJI Warranty Included","DJI Tello Boost Combo  3 Batteries & Charging Hub-DJI Certified refurbished","Ready to Fly Drone","0190021324664","https://www.ebay.com/itm/304075610465","149","$149.00","44 sold","Free shipping and returns","66 watchers",,,
"4","4 available","Yuneec","See more Yuneec YUNTYHSCUS Typhoon H Surveillance Video...",,,"https://i.ebayimg.com/images/g/rXwAAOSwZPZZ6OUw/s-l300.jpg","Kansas City, Missouri, United States","303202014519","YUNTYHSCUS","549.99","US $549.99","genuineauthenticdeals","93","","YUNEEC - Typhoon H  with CGO3+ 4K Cam / ST16 Pro / 90 Day Warranty","Ready to Fly Drone","0813646025661","https://www.ebay.com/itm/303202014519",,,"93 sold","30-day returns","Ships from United States",,,
,,"DJI","Camera Drones",,,"https://i.ebayimg.com/images/g/UjMAAOSwCC1hnZ-w/s-l300.jpg","Miami Beach, Florida, United States","373803194053",,"695","US $695.00","tolap28",,"Less than 2 hour flight time. Includes new propellers.","DJI Phantom 3 professional Drone 4K Camera. 5 Batteries Included. Hard Case","Professional Drone",,"https://www.ebay.com/itm/373803194053",,,"Ships from United States",,,,,
"116","116 available","DJI","Camera Drones",,"0190021338968","https://i.ebayimg.com/images/g/mEYAAOSwtfNfY4zT/s-l300.jpg","Rogers, Arkansas, United States","124224784041","CP.MA.00000120.01","169","US $169.00","vipoutlet","872","","DJI  MT1SS5 Mavic Mini S -Foldable Drone With Remote Controller","Ready to Fly Drone","190021338968","https://www.ebay.com/itm/124224784041","399","$399.00","872 sold","Free shipping and returns","Ships from United States",,,
"10","More than 10 available","4DRC","Camera Drones","Other RC Model Vehicles & Kits",,"https://i.ebayimg.com/images/g/m2QAAOSwnq5hUZwY/s-l300.jpg","Los Angeles, California, United States","403301990567","Does Not Apply","38.98","US $38.98/ea","duoerlan95","26","","RC Drone 4k HD Wide Angle Camera WIFI FPV Drone Dual Camera Quadcopter XMAS GIFT","Professional Drone","Does not apply","https://www.ebay.com/itm/403301990567","38.98","US $38.98","26 sold","30-day returns","Ships from United States",,,
"3","3 available","DJI","Camera Drones",,,"https://i.ebayimg.com/images/g/AAsAAOSwb7RhnoD-/s-l300.jpg","Miami, Florida, United States","185160221702",,"1299","US $1,299.00","infinity-drones","2","","DJI RC Pro Smart Remote Controller  for Mavic 3 Combo Cine Drone NEW 2 Day Ship","smart remote FPV","6941565918307","https://www.ebay.com/itm/185160221702",,,"Free shipping and returns","Ships from United States","6 watchers",,,
"3","3 available","Potensic","Camera Drones",,,"https://i.ebayimg.com/images/g/KAEAAOSw58dhJeFt/s-l300.jpg","CA, United States","284423502372","P1-Pro","200.09","US $200.09","botasy1988","47","2KM Transmission Range, 28mins Flight, Brushless Motor","Potensic Dreamer Pro Drone with 4K HDR Camera FPV 3-Axis Gimbal GPS Quadcopter","Ready to Fly Drone","884017399889","https://www.ebay.com/itm/284423502372","289.99","US $289.99","47 sold","30-day returns","Ships from United States",,,
,,"DJI","Camera Drones",,,"https://i.ebayimg.com/images/g/ZmsAAOSwtp5hns5I/s-l300.jpg","Los Angeles, California, United States","234303587269",,"600","US $600.00","crnmb87",,"","DJI Smart Controller","n/a","Does not apply","https://www.ebay.com/itm/234303587269",,,"30-day returns","Ships from United States","10 watchers",,,
"2","2 available","DJI","Camera Drones",,,"https://i.ebayimg.com/images/g/cRgAAOSwDuFhnG0d/s-l300.jpg","Plano, Texas, United States","154714905690","W323","150","US $150.00","tech1238","1","","DJI Phantom 3 Professional QUADCOPTER ONLY - Flies Great","Professional Drone","Does not apply","https://www.ebay.com/itm/154714905690",,,"Ships from United States",,,,,
"10","More than 10 available","DJI","Camera Drones",,,"https://i.ebayimg.com/images/g/YIIAAOSwzmZfqc-X/s-l300.jpg","Crescent City, California, United States","284074837141","Does Not Apply","39","US $39.00","dronebits","355","","Genuine NEW DJI Mini 2 / SE Intelligent Flight Battery Pack - Spare Extra Charge","Battery","Does not apply","https://www.ebay.com/itm/284074837141",,,"355 sold","30-day returns","Ships from United States",,,
"10","More than 10 available","DJI","See more DJI Mini 2 4K Quadcopter with Remote Controlle...",,,"https://i.ebayimg.com/images/g/BLkAAOSw96FfpCND/s-l300.jpg","New York, New York, United States","303754727647","CP.MA.00000312.01","449","US $449.00","dronesuperstore","765","DJI Official eBay Outlet Store, DJI Warranty Included","DJI Mini 2 Drone Ready To Fly","Ready to Fly Drone","0190021030824","https://www.ebay.com/itm/303754727647",,,"765 sold","Free shipping and returns","Ships from United States",,,
"6","6 available","4DRC","Other RC Model Vehicles & Kits","Camera Drones",,"https://i.ebayimg.com/images/g/YkgAAOSw6lZfUkgP/s-l300.jpg","Hebron, Kentucky, United States","294029202921","Does Not Apply","38.99","US $38.99/ea","4drctoys","58","","2021 New Rc Drone 4k HD Wide Angle Camera WiFi fpv Drone Dual Camera Quadcopter",,"787166531226","https://www.ebay.com/itm/294029202921","38.99","US $38.99","Free shipping and returns","58 sold","Ships from United States",,,
,"Limited quantity available","DJI","See more DJI Air 2S Fly More Combo Drone Quadcopter - C...",,,"https://i.ebayimg.com/images/g/ZBwAAOSwom5geE5S/s-l300.jpg","New York, New York, United States","303960778907","CP.MA.00000346.01","1299","US $1,299.00","dronesuperstore","148","DJI Official eBay Outlet Store, DJI Warranty Included","DJI Air 2S Fly More Combo Drone  Quadcopter Foldable","QuadCopter","190021036581","https://www.ebay.com/itm/303960778907",,,"148 sold","Free shipping and returns","Ships from United States",,,
"2","2 available","4DRC","Camera Drones",,,"https://i.ebayimg.com/images/g/yJ8AAOSwAxthBoeC/s-l300.jpg","Houston, Texas, United States","334128175692",,"40","US $40.00/ea","4drc702","87","","[Factory Refurbish]F4 Brushless Motor Drone with 4K HD Camera FPV GPS Foldable",,,"https://www.ebay.com/itm/334128175692","40","US $40.00","Free shipping and returns","87 sold","Ships from United States",,,
"5","5 available","4DRC","Camera Drones","Other RC Model Vehicles & Kits",,"https://i.ebayimg.com/images/g/ih4AAOSwfOVhBP~I/s-l300.jpg","Houston, Texas, United States","294305185607",,"35","US $35.00/ea","4drctoys","90","","[Factory Refurbish] GPS FPV RC Drone with 4K EIS UHD Camera Quadcopter Brushless",,,"https://www.ebay.com/itm/294305185607","35","US $35.00","Free shipping and returns","90 sold","Ships from United States",,,
"9","9 available","4DRC","Camera Drones",,,"https://i.ebayimg.com/images/g/DLYAAOSwf1dgtiCL/s-l300.jpg","Hebron, Kentucky, United States","294302305292",,"60.99","US $60.99/ea","4drctoys","67","","Drone 4K HD dual camera foldable WIFI FPV air pressure altitude maintenance Quad","Selfie Drone","941358884556","https://www.ebay.com/itm/294302305292","60.99","US $60.99","67 sold","Free shipping and returns","181 watchers",,,
,,"DJI","Camera Drones",,,"https://i.ebayimg.com/images/g/mmAAAOSw2cdhnT14/s-l300.jpg","Las Vegas, Nevada, United States","255243296740","Goggles RE","399","US $399.00","flashmarket",,"","DJI Goggles RE Racing Edition","FPV Goggles","Does not apply","https://www.ebay.com/itm/255243296740",,,"Ships from United States",,,,,
,,"Skydio","Camera Drones",,,"https://i.ebayimg.com/images/g/Ll4AAOSwRRNhkbWA/s-l300.jpg","Hayward, California, United States","363634046190",,"630","US $630.00","clacast-12",,"","skydio 2 drone starter kit with beacon","Ready to Fly Drone",,"https://www.ebay.com/itm/363634046190",,,"9 watchers","Ships from United States",,,,
,,"Fly","Camera Drones",,,"https://i.ebayimg.com/images/g/wLoAAOSwZ2VhnlSN/s-l300.jpg","Macomb, Michigan, United States","284541659341",,"700","US $700.00","macop2004",,"","DJI Mavic Pro Fly More Drone Combo Kit","Professional Drone",,"https://www.ebay.com/itm/284541659341",,,"Ships from United States",,,,,
"5","5 available","Ruko","Camera Drones",,"N/A","https://i.ebayimg.com/images/g/WhcAAOSwXPVhXPZf/s-l300.jpg","Miami, Florida, United States","393613298691","F11 GIM","119.99","US $119.99","magnusale01","16","","Ruko F11 Pro 4K HD Folding GPS Video Recording Remote Control Drone - Used","Ready to Fly Drone","Does Not Apply","https://www.ebay.com/itm/393613298691",,,"30-day returns","Ships from United States","58 watchers",,,
,,"DJI","Camera Drones",,,"https://i.ebayimg.com/images/g/q4IAAOSw6gVhladR/s-l300.jpg","Mount Shasta, California, United States","165201010338",,"519.99","US $519.99","stop-and-smell-the-roses",,"","New DJI Mini 2 Drone Fly More Combo Bundle","Professional Drone","Does not apply","https://www.ebay.com/itm/165201010338",,,"Ships from United States","5 watchers",,,,
,"Limited quantity available","DJI","See more DJI Mavic Air 2 Camera Drone",,,"https://i.ebayimg.com/images/g/JbAAAOSwXGVevEw9/s-l300.jpg","New York, New York, United States","304026749997","CP.MA.00000176.03","589","US $589.00","dronesuperstore","185","DJI Official eBay Outlet Store, DJI Warranty Included","DJI Mavic Air 2 Drone 4K Camera Quadcopter Foldable - Certified Refurbished","QuadCopter","0190021015999","https://www.ebay.com/itm/304026749997","999","$999.00","185 sold","Free shipping and returns","Ships from United States",,,
"10","More than 10 available","DJI","See more DJI Mavic Mini Camera Drone",,,"https://i.ebayimg.com/images/g/7REAAOSwPJVhnn2H/s-l300.jpg","New York, New York, United States","304105388030","CP.MA.00000120.01","299","US $299.00","dronesuperstore","562","DJI Official eBay Outlet Store","DJI Mavic Mini Portable Drone Quadcopter Pro Combo Bundle","Ready to Fly Drone","0190021338968","https://www.ebay.com/itm/304105388030",,,"562 sold","Free shipping and returns","Ships from United States",,,
"9","9 available","Holy Stone","Camera Drones","Quadcopters & Multicopters",,"https://i.ebayimg.com/images/g/CQIAAOSw3D1hdmlY/s-l300.png","California, United States","383584078630","Does not apply","239","US $239.00/ea","amberc-95","153","","Holy Stone HS720 4K GPS Drone with HD Camera Brushless Quadcopter 2 Battery US","Ready to Fly Drone","Does not apply","https://www.ebay.com/itm/383584078630","478","US $478.00","153 sold","Free shipping and returns","Ships from United States",,,
"10","More than 10 available","YELANGU","See more YELANGU  Hobby Grade Foldable Drones",,"0745761422813","https://i.ebayimg.com/images/g/upkAAOSwxaxhAU1G/s-l300.jpg","Hebron, Kentucky, United States","294300787416","Does Not Apply","30.99","US $30.99/ea","4drctoys","46","","4DRC V9 Mini Drone Kit with 4K HD Camera WIFI FPV RC Quadcopter Foldable Drone","Battery","0745761422813","https://www.ebay.com/itm/294300787416","30.99","US $30.99","Free shipping and returns","46 sold","Ships from United States",,,
"5","5 available","Holy Stone","Quadcopters & Multicopters","Camera Drones",,"https://i.ebayimg.com/images/g/zDcAAOSw6A1hn0a4/s-l300.jpg","Walton, Kentucky, United States","154428853001","Does Not Apply","109","US $109.00/ea","holystone_au","29","","Holy Stone HS130D GPS FPV Drone with 2K HD Camera 5G RC Quadcopter 2 Batteries","Quadcopter","Does not apply","https://www.ebay.com/itm/154428853001","218","US $218.00","29 sold","30-day returns","Ships from United States",,,
,,"DJI","Camera Drones",,,"https://i.ebayimg.com/images/g/4BgAAOSwwFFhlyTI/s-l300.jpg","Burlington, Iowa, United States","175036555792",,"135","US $135.00","319bigboy73",,"","dj mavic mini","Ready to Fly Drone",,"https://www.ebay.com/itm/175036555792",,,"Ships from United States",,,,,
,"Last one","Yuneec","Camera Drones",,,"https://i.ebayimg.com/images/g/Vk0AAOSwuZthFW~i/s-l300.jpg","Los Angeles, California, United States","174887794448",,"129.99","US $129.99","electronics_products_2317","21","","Yuneec Breeze Flying Camera Compact Smart Drone Ultra High Definition 4K Video","N/A","Does not apply","https://www.ebay.com/itm/174887794448",,,"21 sold","Ships from United States","25 watchers",,,
"10","More than 10 available","DJI","Camera Drones",,,"https://i.ebayimg.com/images/g/bQYAAOSwPKReZnsL/s-l300.jpg","Miami, Florida, United States","184145970307","Does Not Apply","34","US $34.00/ea","infinity-drones","224","","Original New DJI Mavic Mini Two-Way Charging Hub - Battery Multi-charger Bank","charger","Does not apply","https://www.ebay.com/itm/184145970307","34","US $34.00","Free shipping and returns","224 sold","Ships from United States",,,
,,"Parrot","Camera Drones",,,"https://i.ebayimg.com/images/g/9QQAAOSwXI1hlj3y/s-l300.jpg","Elk Grove Village, Illinois, United States","133938974926",,"113.5","US $113.50","hitexstore",,"","Parrot - Drone Anafi Extended - 4K HDR Camera -READ!!!-","Replacement Unit",,"https://www.ebay.com/itm/133938974926",,,"34 watchers","Ships from United States",,,,
,,"Autel Robotics","Camera Drones",,,"https://i.ebayimg.com/images/g/oDIAAOSwe4lhnFAw/s-l300.jpg","Palatine, Illinois, United States","224706133152",,"149","US $149.00","hakles",,"","autel x-star premium battery","battery",,"https://www.ebay.com/itm/224706133152",,,"Ships from United States",,,,,
"10","More than 10 available","DJI","See more DJI Mini 2 4K Quadcopter with Remote Controlle...",,,"https://i.ebayimg.com/images/g/ruwAAOSwSdFfpCW9/s-l300.jpg","New York, New York, United States","304075568320","CP.MA.00000312.01","449","US $449.00","dronesuperstore","64","DJI Official eBay Outlet Store, DJI Warranty Included","DJI Mini 2 Drone Ready To Fly Starter Bundle","Ready to Fly Drone",,"https://www.ebay.com/itm/304075568320",,,"64 sold","Free shipping and returns","Ships from United States",,,
"10","More than 10 available","DJI","See more Ryze Tech Tello Quadcopter - White (CP.PT.0000...",,,"https://i.ebayimg.com/images/g/5DEAAOSwHPNbIu7K/s-l300.jpg","New York, New York, United States","302772735586","CP.PT.00000252.01","99","US $99.00","dronesuperstore","347","DJI Official eBay Outlet Store, DJI Warranty Included","DJI Tello Drone by Ryze Tech and additional Free Battery","Ready to Fly Drone","0190021310568","https://www.ebay.com/itm/302772735586",,,"347 sold","Free shipping and returns","525 watchers",,,